{"text_format":"3","workbook":"xlsx","n_sheets":5,"sheets":["Modellwerte","Umsetzungstabellen","Versionshistorie","Übersicht","diag_flugzeiten"],"not_rendered":{"charts":2,"macros":1,"defined_names":42,"comments":2},"unopened":[{"sheet":"diag_flugzeiten","index":4,"reason":"not_a_worksheet"}],"read":"whole","date_system":"1900"}

{"sheet":"Modellwerte","index":0,"n_rows":83,"n_cols":24,"rows_kept":83}
["Parameter","par_file","par_typ","par_inhalt","Inhalt",{"$nulls":3},"Benutzername:"]
["Dateiname:",{"$nulls":3},"0032Ther.jsn (Ausw. vom 07.02.2019)"]
["Pfad:",{"$nulls":3},"C:\\Users\\hermann\\Dropbox\\Modellflug\\jeti\\jeti_dc16\\eigene_modelle\\Model\\",null,"CTR+SHFT+R",null,"CTR+SHFT+Z"]
["Softwarestand Sender","\"TxVers\":","mono",4.28,{"$f":"IF(D4=\"\",\"< 3.2 (V-Nummer nicht vorhanden)\",SUBSTITUTE(D4,\",\",\".\"))","v":"4.28"}]
["Modellname:","\"Name\":","mono","Thermy3",{"$f":"D5","v":"Thermy3"}]
["Modellzeit:","\"Model-Time2\":","mono",773,{"$f":"D6/24/60/60","v":0.00894675925925926}]
["gebundener Empfänger:","\"Receiver-ID1\":","mono",2122360465,{"$f":"MOD(D7,2^16)&\":\"&INT(D7/2^16)","v":"42641:32384"},null,"Parameter wird zur Aufbereitung der Spalte E herangezogen"]
["Modelltyp:","\"Model-Type\":","mono","Aero",{"$f":"VLOOKUP(D8,Modelltyp,2,0)","v":"Flächenmodell"}]
["Flügeltyp:","\"Wing-Type\":","mono",3,{"$f":"VLOOKUP(D9,Flügeltyp,2,0)","v":"2 QR 2 WK"},null,"wird zur Auflösung von Querverweisen in anderen Parametern verwendet"]
["Leitwerkstyp:","\"Tail-Type\":","mono",1,{"$f":"VLOOKUP(D10,Leitwerkstyp,2)","v":"V-LW 2 Servos"}]
["Motor Aus Schalter:","\"Throtle-Cut-Switch\":","mono","12,0,0,0,1,-4000,-1,3",{"$f":"n_sw(D11,\"0\",\"0\",A11)","v":"SD,unten"}]
["Leerlaufschalter:","\"Throtle-Idle-Switch\":","mono","0,0,0,0,1,4000,-1,0",{"$f":"n_sw(D12,\"0\",\"0\",A12)","v":"nicht zugewiesen"}]
["Autotrimm Schalter:","\"Autotrim-Switch\":","mono","0,0,0,0,1,4000,-1,0","nicht zugewiesen"]
["Trainer Schalter:","\"Trainer-Switch\":","mono","0,0,0,0,1,4000,-1,0",{"$f":"n_sw(D14,\"0\",\"0\",A14)","v":"nicht zugewiesen"}]
["Logging Schalter:","\"Logging-Switch\":","mono","12,0,0,0,1,4000,-1,3","SD,oben"]
["Telemetrie-Sprach-Schalter:","\"Telemetry-Voice-Switch\":","mono","0,0,0,0,1,4000,-1,0","nicht zugewiesen"]
["Sprach-Trigger-Schalter:","\"TrigSw\":","mono","13,0,0,0,1,-4000,-1,4",{"$f":"n_sw(D17,\"0\",\"0\",A17)","v":"SE,unten"}]
["Sprach-Wiederh.-Schalter:","\"RepeatSw\":","mono","0,0,0,0,1,4000,2,0","L3,oben"]
["Alarme loggen:","\"Log-Alms\":","mono",1,{"$f":"VLOOKUP(D19,ja_nein,2,FALSE)","v":"ja"}]
["Flugphasen","{\"Type\":\"Fl-Mode\",","multi,ID,1",null,"Name: Schalter, Stellung","ID","Label","Audio","Delay","Switch","DigiTrim","Value","Stored","Step","Max-Pos","Max-Neg","Mode","Group","FuncID"]
[">",{"$nulls":3},{"$f":"G21&\": \"&n_sw(J21,\"0\",\"0\",\"Flugphase:\"&G21)","v":"Standard: nicht zugewiesen"},1,"Standard",null,0,"0,0,0,0,1,4000,-1,0",null,-2,0,2,100,100,0,0,1]
["Funktionen","{\"Type\":\"Function\",","multi,ID,1",null,"Geber / Schalter: Funktionsname","ID","Label","Control","Trim-Control","Trim-Max","Trainer-Enabled","Trainer-Value","Trainer-Channel","G-Trim","G-Curve","G-DR"]
[">",{"$nulls":3},{"$f":"nur_sw(H23,\"Geber \"&G23)&\": \"&G23","v":"Geber P1: Quer"},1,"Quer","1,0,1,1,1,0,-1,1","0,0,1,1,1,4000,-1,0",50,0,100,1,1,1,1]
[">",{"$nulls":3},"Geber P2: Höhe",2,"Höhe","2,0,1,1,1,0,-1,1","0,0,1,1,1,4000,-1,0",50,0,100,2,1,1,1]
[">",{"$nulls":3},"Geber P3: Seite",3,"Seite","4,0,1,1,1,0,-1,1","0,0,1,1,1,4000,-1,0",50,0,100,3,1,1,1]
[">",{"$nulls":3},"Geber P4: Drossel",4,"Drossel","3,0,1,1,1,0,-1,1","0,0,1,1,1,4000,-1,0",50,0,100,4,1,1,1]
[">",{"$nulls":3},{"$f":"nur_sw(H27,\"Geber \"&G27)&\": \"&G27","v":"Geber P4: Klappen"},6,"Klappen","3,0,1,1,1,0,-1,1","0,0,1,1,1,4000,-1,0",50,0,100,5,1,1,1]
["Funktionsspezifikationen","{\"Type\":\"Function-Spec\",","multi,ID,1",null,"Flugphase, Funktion, DR-Schalter, Phasen-Trim","Flight-Mode","Function-Id","FM-Delay","Ph-Trim","Expo-Pos","Expo-Neg","DR-Pos","DR-Neg","Delay-Pos","Delay-Neg","Sym","SmthDR","SmthCrv","DR-Switch","Curve-Type","Points-In","Points-Out"]
[">",{"$nulls":3},{"$f":"VLOOKUP(F29,sv_phase,2,FALSE)&\": \"&VLOOKUP(G29,sv_function,2,FALSE)&IF(LEFT(fw_vers,1)=\"<\",IF(sel_par(P29,1)>\"0\",\", DR-S: \"&n_sw(P29,\"0\",\"0\",\"DR_S Pph\"&F29),\"\"),IF(sel_par(Q29,1)>\"0\",\", DR-S: \"&n_sw(Q29,\"0\",\"0\",\"DR-S Fph\"&F29),\"\"))&IF(I29<>\"0,0,0,0\",\" (\"&I29&\")\",\"\")&\", Expo:\"&sel_par(J29,1)&\"%\"","v":"Standard: Quer, Expo:0%"},1,1,1,"0,0,0,0","0,0,0","0,0,0",{"v":100100100,"d":"100,100,100"},{"v":100100100,"d":"100,100,100"},0,0,1,0,0,"0,0,0,1,1,4000,-1,0",0,0,0]
[">",{"$nulls":3},{"$f":"VLOOKUP(F30,sv_phase,2,FALSE)&\": \"&VLOOKUP(G30,sv_function,2,FALSE)&IF(LEFT(fw_vers,1)=\"<\",IF(sel_par(P30,1)>\"0\",\", DR-S: \"&n_sw(P30,\"0\",\"0\",\"DR_S Pph\"&F30),\"\"),IF(sel_par(Q30,1)>\"0\",\", DR-S: \"&n_sw(Q30,\"0\",\"0\",\"DR-S Fph\"&F30),\"\"))&IF(I30<>\"0,0,0,0\",\" (\"&I30&\")\",\"\")&\",Expo:\"&sel_par(J30,1)&\"%\"","v":"Standard: Höhe,Expo:0%"},1,2,1,"0,0,0,0","0,0,0","0,0,0",{"v":100100100,"d":"100,100,100"},{"v":100100100,"d":"100,100,100"},0,0,1,0,0,"0,0,0,1,1,4000,-1,0",0,0,0]
[">",{"$nulls":3},{"$f":"VLOOKUP(F31,sv_phase,2,FALSE)&\": \"&VLOOKUP(G31,sv_function,2,FALSE)&IF(LEFT(fw_vers,1)=\"<\",IF(sel_par(P31,1)>\"0\",\", DR-S: \"&n_sw(P31,\"0\",\"0\",\"DR_S Pph\"&F31),\"\"),IF(sel_par(Q31,1)>\"0\",\", DR-S: \"&n_sw(Q31,\"0\",\"0\",\"DR-S Fph\"&F31),\"\"))&IF(I31<>\"0,0,0,0\",\" (\"&I31&\")\",\"\")&\",Expo:\"&sel_par(J31,1)&\"%\"","v":"Standard: Seite,Expo:0%"},1,3,1,"0,0,0,0","0,0,0","0,0,0",{"v":100100100,"d":"100,100,100"},{"v":100100100,"d":"100,100,100"},0,0,1,0,0,"0,0,0,1,1,4000,-1,0",0,0,0]
[">",{"$nulls":3},{"$f":"VLOOKUP(F32,sv_phase,2,FALSE)&\": \"&VLOOKUP(G32,sv_function,2,FALSE)&IF(LEFT(fw_vers,1)=\"<\",IF(sel_par(P32,1)>\"0\",\", DR-S: \"&n_sw(P32,\"0\",\"0\",\"DR_S Pph\"&F32),\"\"),IF(sel_par(Q32,1)>\"0\",\", DR-S: \"&n_sw(Q32,\"0\",\"0\",\"DR-S Fph\"&F32),\"\"))&IF(I32<>\"0,0,0,0\",\" (\"&I32&\")\",\"\")&\",Expo:\"&sel_par(J32,1)&\"%\"","v":"Standard: Drossel,Expo:0%"},1,4,1,"0,0,0,0","0,0,0","0,0,0",{"v":100100100,"d":"100,100,100"},{"v":100100100,"d":"100,100,100"},0,0,1,0,0,"0,0,0,1,1,4000,-1,0",8,"-100,10,100","-100,-101,100"]
[">",{"$nulls":3},{"$f":"VLOOKUP(F33,sv_phase,2,FALSE)&\": \"&VLOOKUP(G33,sv_function,2,FALSE)&IF(LEFT(fw_vers,1)=\"<\",IF(sel_par(P33,1)>\"0\",\", DR-S: \"&n_sw(P33,\"0\",\"0\",\"DR_S Pph\"&F33),\"\"),IF(sel_par(Q33,1)>\"0\",\", DR-S: \"&n_sw(Q33,\"0\",\"0\",\"DR-S Fph\"&F33),\"\"))&IF(I33<>\"0,0,0,0\",\" (\"&I33&\")\",\"\")&\",Expo:\"&sel_par(J33,1)&\"%\"","v":"Standard: Klappen,Expo:0%"},1,6,1,"0,0,0,0","0,0,0","0,0,0",{"v":100100100,"d":"100,100,100"},{"v":100100100,"d":"100,100,100"},0,0,1,0,0,"0,0,0,1,1,4000,-1,0",8,"-100,0,100",{"v":-100100100,"d":"-100,100,100"}]
["Servoeinstellungen","{\"Type\":\"Servo\"","multi,Index,0",null,"Funktion: Rx-Kanal, Laufrichtung, Mittenstellung","Index","Servo-Code","Middle","Max-Positive","Max-Negative","Max-Positive-Limit","Max-Negative-Limit","Fail-Safe-Pos","Delay-Positive","Delay-Negative","Offset","Servo-Reverse","Curve"]
[">",{"$nulls":3},{"$f":"\"Rx K\"&F35&\": \"&VLOOKUP(G35,Servo,2,FALSE)&\", Laufr. \"&VLOOKUP(Q35,Laufrichtung,2,FALSE)&\", Min=\"&J35&\"%, Mitte=\"&H35&\"%, Max=\"&I35&\"%\"","v":"Rx K1: Drossel, Laufr. normal, Min=-100%, Mitte=0%, Max=100%"},1,271,0,100,-100,125,-125,0,0,0,0,0,"0,0,0,0,0,0,0,0,0,0,0,0,0"]
[">",{"$nulls":3},"Rx K2: Quer1, Laufr. reverse, Min=-70%, Mitte=0%, Max=70%",2,257,0,70,-70,80,-80,0,0,0,0,1,"0,0,0,0,0,0,0,0,0,0,0,0,0"]
[">",{"$nulls":3},"Rx K3: Höhe1, Laufr. normal, Min=-110%, Mitte=0%, Max=90%",3,267,0,90,-110,90,-110,0,0,0,0,0,"0,0,0,0,0,0,0,0,0,0,0,0,0"]
[">",{"$nulls":3},"Rx K4: Höhe2, Laufr. normal, Min=-90%, Mitte=0%, Max=110%",4,268,0,110,-90,110,-90,0,0,0,0,0,"0,0,0,0,0,0,0,0,0,0,0,0,0"]
[">",{"$nulls":3},{"$f":"\"Rx K\"&F39&\": \"&VLOOKUP(G39,Servo,2,FALSE)&\", Laufr. \"&VLOOKUP(Q39,Laufrichtung,2,FALSE)&\", Min=\"&J39&\"%, Mitte=\"&H39&\"%, Max=\"&I39&\"%\"","v":"Rx K5: Quer2, Laufr. reverse, Min=-70%, Mitte=0%, Max=70%"},5,258,0,70,-70,70,-70,0,0,0,0,1,"0,0,0,0,0,0,0,0,0,0,0,0,0"]
[">",{"$nulls":3},{"$f":"\"Rx K\"&F40&\": \"&VLOOKUP(G40,Servo,2,FALSE)&\", Laufr. \"&VLOOKUP(Q40,Laufrichtung,2,FALSE)&\", Min=\"&J40&\"%, Mitte=\"&H40&\"%, Max=\"&I40&\"%\"","v":"Rx K6: Klappen1, Laufr. normal, Min=-80%, Mitte=0%, Max=80%"},6,261,0,80,-80,80,-80,0,0,0,0,0,"0,0,0,0,0,0,0,0,0,0,0,0,0"]
[">",{"$nulls":3},{"$f":"\"Rx K\"&F41&\": \"&VLOOKUP(G41,Servo,2,FALSE)&\", Laufr. \"&VLOOKUP(Q41,Laufrichtung,2,FALSE)&\", Min=\"&J41&\"%, Mitte=\"&H41&\"%, Max=\"&I41&\"%\"","v":"Rx K7: Klappen2, Laufr. normal, Min=-79%, Mitte=0%, Max=80%"},7,262,0,80,-79,80,-80,0,0,0,0,0,"0,0,0,0,0,0,0,0,0,0,0,0,0"]
["Timer","{\"Type\":\"Timer\",","multi,ID,1",null,"Name: von Zeit -> bis Zeit, Schalter","Label","ID","Init-Time","Dest-Time","Tim-Type","Report-Type","Switch","Sw-Rst","Reset-Type","All-Modes","Time","Round-Len","Round-Val"]
[">",{"$nulls":3},{"$f":"F43&\": \"&IF(OR(H43>0,I43>0)=TRUE,z_u(H43)&\"->\"&z_u(I43)&\", \",\"\")&nur_sw(L43,\"Timer:\"&F43)","v":"Motorzeit: L1"},"Motorzeit",2,0,0,0,0,"0,0,0,0,1,4000,0,0","0,0,0,0,1,4000,-1,0",0,0,0,-1]
[">",{"$nulls":3},{"$f":"F44&\": \"&IF(OR(H44>0,I44>0)=TRUE,z_u(H44)&\"->\"&z_u(I44)&\", \",\"\")&nur_sw(L44,\"Timer:\"&F44)","v":"Segelzeit: L2"},"Segelzeit",3,0,0,0,0,"0,0,0,0,1,4000,1,0","0,0,0,0,1,4000,-1,0",0,0,0,-1]
[">",{"$nulls":3},{"$f":"F45&\": \"&IF(OR(H45>0,I45>0)=TRUE,z_u(H45)&\"->\"&z_u(I45)&\", \",\"\")&nur_sw(L45,\"Timer:\"&F45)","v":"akt.Flugzeit: MX1"},"akt.Flugzeit",4,0,0,0,0,"0,0,0,0,1,4000,48,0","0,0,0,0,1,4000,-1,0",0,0,0,-1]
["Alarme","{\"Type\":\"Alarm\",","multi,direkt,0",null,"Schalter, Schalterstellung, Wert","Type","Active","Switch","Var-Greater","Decimals","File","Sensor-ID","Sensor-Param","SType","Repeat","Voice","Thro-Idle","Value","Vibr","Prefl"]
[">",{"$nulls":3},{"$f":"IF(K47>\"\",LEFT(K47,LEN(K47)-4)&\": \",\"\")&IF(OR(sel_par(H47,1)>\"0\",sel_par(H47,7)<>\"-1\")=TRUE,n_sw(H47,\"0\",\"0\",K47)&\", \",\"\")&\"Wert:\"&VLOOKUP(I47,Vergleich,2,0)&p_wert(R47,J47)","v":"NIEDRRXS: Wert:<=4,7"},"Alarm",1,"0,0,0,0,1,4000,-1,0",0,2,"NIEDRRXS.WAV",0,1,2,1,1,0,470,0,0]
[">",{"$nulls":3},{"$f":"IF(K48>\"\",LEFT(K48,LEN(K48)-4)&\": \",\"\")&IF(OR(sel_par(H48,1)>\"0\",sel_par(H48,7)<>\"-1\")=TRUE,n_sw(H48,\"0\",\"0\",K48)&\", \",\"\")&\"Wert:\"&VLOOKUP(I48,Vergleich,2,0)&p_wert(R48,J48)","v":"NIEDRIAK: Wert:<=10,2"},"Alarm",1,"0,0,0,0,1,4000,-1,0",0,2,"NIEDRIAK.WAV",809083650,1,2,1,1,0,1020,0,0]
[">",{"$nulls":3},{"$f":"IF(K49>\"\",LEFT(K49,LEN(K49)-4)&\": \",\"\")&IF(OR(sel_par(H49,1)>\"0\",sel_par(H49,7)<>\"-1\")=TRUE,n_sw(H49,\"0\",\"0\",K49)&\", \",\"\")&\"Wert:\"&VLOOKUP(I49,Vergleich,2,0)&p_wert(R49,J49)","v":"NIEDRE~1: Wert:<=11,4"},"Alarm",1,"0,0,0,0,1,4000,-1,0",0,2,"NIEDRE~1.WAV",809083650,1,2,2,1,0,1140,0,1]
[">",{"$nulls":3},{"$f":"IF(K50>\"\",LEFT(K50,LEN(K50)-4)&\": \",\"\")&IF(OR(sel_par(H50,1)>\"0\",sel_par(H50,7)<>\"-1\")=TRUE,n_sw(H50,\"0\",\"0\",K50)&\", \",\"\")&\"Wert:\"&VLOOKUP(I50,Vergleich,2,0)&p_wert(R50,J50)","v":"AKKUKAPA: Wert:>=2000"},"Alarm",1,"0,0,0,0,1,4000,-1,0",1,0,"AKKUKAPA.WAV",809083650,3,2,0,1,0,2000,0,0]
["Logische Schalter","{\"Type\":\"Log-Sw\",","multi,Index,0",null,"Lx,Name: Geber/Schalter,Stellung Verkn.  G/S2, Stellung","Index","Enabled","Label","Switch1","Switch2","Cond1","Cond2","Value1","Value2","Log-Type"]
[">",{"$nulls":3},{"$f":"l_sw(F52,H52,I52,J52,K52,L52,M52,N52,O52,\"L\"&F52)","v":"L1,Motorein: Geber P4>4% UND SD,oben"},1,1,"Motorein","3,0,1,1,1,4000,-1,1","12,0,0,1,1,4000,-1,3",1,0,160,0,1]
[">",{"$nulls":3},{"$f":"l_sw(F53,H53,I53,J53,K53,L53,M53,N53,O53,\"L\"&F53)","v":"L2,Motoraus: Geber P4<4% n.n. nicht zugewiesen"},2,1,"Motoraus","3,0,1,1,1,4000,-1,1","0,0,0,1,1,4000,-1,0",0,0,160,0,0]
[">",{"$nulls":3},{"$f":"l_sw(F54,H54,I54,J54,K54,L54,M54,N54,O54,\"L\"&F54)","v":"L3,TeleAnsage: SE,oben ODER MX2,oben"},3,1,"TeleAnsage","13,0,0,1,1,4000,-1,4","0,0,0,1,1,4000,49,0",1,0,0,0,2]
[">",{"$nulls":3},{"$f":"l_sw(F55,H55,I55,J55,K55,L55,M55,N55,O55,\"L\"&F55)","v":"L4,Leerlauf: L1,oben UND MX3,oben"},4,1,"Leerlauf","0,0,0,1,1,4000,0,0","0,0,0,1,1,4000,50,0",1,0,0,0,1]
[">",{"$nulls":3},{"$f":"l_sw(F56,H56,I56,J56,K56,L56,M56,N56,O56,\"L\"&F56)","v":"L5,Klappenaus: MX4,oben UND Geber P4,oben"},5,1,"Klappenaus","0,0,0,1,1,4000,51,0","3,0,1,1,1,4000,-1,1",1,0,0,0,1]
[">",{"$nulls":3},{"$f":"l_sw(F57,H57,I57,J57,K57,L57,M57,N57,O57,\"L\"&F57)","v":"L6,Telemaus: Q2,oben UND SE,Mitte"},6,1,"Telemaus","0,0,1,1,1,4000,81,0","13,0,0,1,1,0,-1,4",0,0,0,0,1]
["Ereignis Ansagen","{\"Switch\":","multi,direkt,0",null,"Geber/Schalter, Stellung: Sounddatei","Switch","Delay","Repeat","File"]
[">",{"$nulls":3},{"$f":"n_sw(F59,\"0\",\"0\",\"Ereignisansage:\"&I59)&\": \"&I59","v":"SD,oben: P_ZUEN~1.WAV"},"12,0,0,0,1,4000,-1,3",0,0,"P_ZUEN~1.WAV"]
[">",{"$nulls":3},{"$f":"n_sw(F60,\"0\",\"0\",\"Ereignisansage:\"&I60)&\": \"&I60","v":"SD,unten: P_ZUEN~2.WAV"},"12,0,0,0,1,-4000,-1,3",0,0,"P_ZUEN~2.WAV"]
[">",{"$nulls":3},{"$f":"n_sw(F61,\"0\",\"0\",\"Ereignisansage:\"&I61)&\": \"&I61","v":"L4,oben: T_DING.WAV"},"0,0,0,0,1,4000,3,0",0,1,"T_DING.WAV"]
[">",{"$nulls":3},{"$f":"n_sw(F62,\"0\",\"0\",\"Ereignisansage:\"&I62)&\": \"&I62","v":"L5,oben: T_ERROR.WAV"},"0,0,0,0,1,4000,4,0",0,1,"T_ERROR.WAV"]
[">",{"$nulls":3},{"$f":"n_sw(F63,\"0\",\"0\",\"Ereignisansage:\"&I63)&\": \"&I63","v":"L6,oben: AUTOTE~1.WAV"},"0,0,0,0,1,4000,5,0",0,0,"AUTOTE~1.WAV"]
["Freie Mixer","{\"Type\":\"Mixes-Main\",","multi,Data,1",null,"von Geber > auf Geber","Data"]
[">",{"$nulls":3},{"$f":"VLOOKUP(VALUE(sel_par(F65,1)),sv_function,2,FALSE)&\"->\"&VLOOKUP(VALUE(sel_par(F65,2)),sv_function,2,FALSE)","v":"Drossel->Höhe"},"4,2,1,1"]
[">",{"$nulls":3},{"$f":"VLOOKUP(VALUE(sel_par(F66,1)),sv_function,2,FALSE)&\"->\"&VLOOKUP(VALUE(sel_par(F66,2)),sv_function,2,FALSE)","v":"Drossel->Seite"},"4,3,1,1"]
[">",{"$nulls":3},{"$f":"VLOOKUP(VALUE(sel_par(F67,1)),sv_function,2,FALSE)&\"->\"&VLOOKUP(VALUE(sel_par(F67,2)),sv_function,2,FALSE)","v":"Klappen->Quer"},"6,1,1,1"]
[">",{"$nulls":3},{"$f":"VLOOKUP(VALUE(sel_par(F68,1)),sv_function,2,FALSE)&\"->\"&VLOOKUP(VALUE(sel_par(F68,2)),sv_function,2,FALSE)","v":"Klappen->Höhe"},"6,2,1,1"]
["Freie Mixer Einstellungen","{\"Type\":\"Mix\",","multi,ID,1",null,"Flugphase: von Geber > auf Geber, Wert,Schalter","Flight-Mode","Intensity","DelayP","DelayN","DelaySwP","DelaySwN","SmthCrv","Switch","S-Output","S-OutputN","Direction","M-Link","S-Link","M-Trim","S-DR","S-Diff","Curve-Type","Points-In","Points-Out"]
[">",{"$f":"IF(F70<>F69,1,B69+1)","v":1},null,null,{"$f":"VLOOKUP(F70,sv_phase,2,FALSE)&\": \"&zs_zelle(ROW(mixer)+B70,COLUMN(mixer_inhalt))&\", \"&G70&\"%\"&IF(OR(sel_par(M70,1)<>\"0\",sel_par(M70,7)<>\"-1\")=TRUE,\", \"&nur_sw(M70,\"Mixer\"&B70),\"\")","v":"Standard: Drossel->Höhe, 0%"},1,0,8,0,0,0,0,"0,0,0,1,1,4000,-1,0",{"v":100100100100,"d":"100,100,100,100"},{"v":100100100100,"d":"100,100,100,100"},1,0,0,0,0,1,0,0,0]
[">",{"$f":"IF(F71<>F70,1,B70+1)","v":2},null,null,{"$f":"VLOOKUP(F71,sv_phase,2,FALSE)&\": \"&zs_zelle(ROW(mixer)+B71,COLUMN(mixer_inhalt))&\", \"&G71&\"%\"&IF(OR(sel_par(M71,1)<>\"0\",sel_par(M71,7)<>\"-1\")=TRUE,\", \"&nur_sw(M71,\"Mixer\"&B71),\"\")","v":"Standard: Drossel->Seite, 0%"},1,0,8,0,0,0,0,"0,0,0,1,1,4000,-1,0",{"v":100100100100,"d":"100,100,100,100"},{"v":100100100100,"d":"100,100,100,100"},1,0,0,0,0,1,0,0,0]
[">",{"$f":"IF(F72<>F71,1,B71+1)","v":3},null,null,{"$f":"VLOOKUP(F72,sv_phase,2,FALSE)&\": \"&zs_zelle(ROW(mixer)+B72,COLUMN(mixer_inhalt))&\", \"&G72&\"%\"&IF(OR(sel_par(M72,1)<>\"0\",sel_par(M72,7)<>\"-1\")=TRUE,\", \"&nur_sw(M72,\"Mixer\"&B72),\"\")","v":"Standard: Klappen->Quer, 90%"},1,90,0,0,0,0,0,"0,0,0,1,1,4000,-1,0",{"v":100100100100,"d":"100,100,100,100"},{"v":100100100100,"d":"100,100,100,100"},1,0,0,0,0,1,8,"-100,0,100","-99,-50,0"]
[">",{"$f":"IF(F73<>F72,1,B72+1)","v":4},null,null,{"$f":"VLOOKUP(F73,sv_phase,2,FALSE)&\": \"&zs_zelle(ROW(mixer)+B73,COLUMN(mixer_inhalt))&\", \"&G73&\"%\"&IF(OR(sel_par(M73,1)<>\"0\",sel_par(M73,7)<>\"-1\")=TRUE,\", \"&nur_sw(M73,\"Mixer\"&B73),\"\")","v":"Standard: Klappen->Höhe, 30%, Geber P6"},1,30,0,0,0,0,0,"6,0,1,1,1,0,-1,7",{"v":100100100100,"d":"100,100,100,100"},"0,0,100,100",1,0,0,1,0,1,8,"-100,0,100","-100,-50,1"]
["User Menü","{\"Type\":\"User-Menu\",","multi,Data,1",null,"Menüpunkte","Data"]
[">",null,null,{"$f":"E75","v":"Servomonitor\nGebermonitor (1/2)\nGebermonitor (2/2)\n"},{"$f":"u_menu(F75)","v":"Servomonitor\nGebermonitor (1/2)\nGebermonitor (2/2)\n"},"31,29,30"]
["Sequenzer","{\"Type\":\"Seq\",","multi,ID,1",null,"Bezeichnung, Schalter","ID","Switch","Label","Override","Asymm","Cycle","Finish","Points","Data","Data","Data","PointsB","Data","Data","Data"]
[">",{"$nulls":3},{"$f":"q_sw(F77,H77,G77)","v":"Q1, Alarm: nicht zugewiesen"},1,"0,0,0,0,1,4000,-1,0","Alarm",0,1,1,0,"0,100",{"v":5100,"d":"5,100"},"6,-100","200,-100","0,100",{"v":5100,"d":"5,100"},"7,-100","200,-100"]
[">",{"$nulls":3},{"$f":"q_sw(F78,H78,G78)","v":"Q2, Telemaus: SE,oben"},2,"13,0,0,0,1,4000,-1,4","Telemaus",0,1,1,1,null,"0,-100",{"v":2100,"d":"2,100"}]
["Telemetrie Geber","{\"Type\":\"Tel-Ctrl\",","multi,Index,0",null,"Mx, Name:  Bedingung, Wert","Index","Enabled","Label","Sensor-ID","Param","Decimals","Default","Switch","Prop","Bin-Data"]
[">",{"$nulls":3},{"$f":"m_sw(F80,H80,K80,N80,O80)","v":"MX1, Höheschal: > 1 +/- 0"},1,1,"Höheschal",809083650,5,1,0,"0,0,0,0,1,4000,-1,0",0,"1,0,10,0"]
[">",{"$nulls":3},{"$f":"m_sw(F81,H81,K81,N81,O81)","v":"MX2, Kapa: > 2200 +/- 0"},2,1,"Kapa",809083650,3,0,0,"0,0,0,0,1,4000,-1,0",0,"1,0,2200,0"]
[">",{"$nulls":3},{"$f":"m_sw(F82,H82,K82,N82,O82)","v":"MX3, Standgas: < 3 +/- 0"},3,1,"Standgas",809083650,2,2,0,"0,0,0,0,1,4000,-1,0",0,"0,0,300,0"]
[">",{"$nulls":3},{"$f":"m_sw(F83,H83,K83,N83,O83)","v":"MX4, Segelhöhe: > 30 +/- 0"},4,1,"Segelhöhe",809083650,5,1,0,"0,0,0,0,1,4000,-1,0",0,"1,0,300,0"]

{"sheet":"Umsetzungstabellen","index":1,"n_rows":233,"n_cols":23,"rows_kept":233,"merged":[[134,4,134,7]]}
[]
[]
[]
[]
[]
[]
["Excelname","Wert","Umsetzung"]
[]
["Flügeltyp",0,"1 QR"]
[null,1,"2 QR"]
[null,2,"2 QR 1 WK"]
[null,3,"2 QR 2 WK"]
[null,4,"4 QR 2 WK"]
[null,5,"2 QR 4 WK"]
[null,6,"4 QR 4 WK"]
[]
["Leitwerkstyp",0,"Kreuz- oder T-LW 1 HR 1 SR"]
[null,1,"V-LW 2 Servos"]
[null,2,"Ailvator 2 HR 1SR"]
[null,3,"2 HR 2 SR"]
[null,4,"Kein LW (Delta/Elevon)"]
[]
["Modelltyp","Aero","Flächenmodell"]
[null,"Heli","Helikopter"]
[]
[{"$nulls":3},"schalter_einträge",{"$nulls":16},{"$f":"T26+1","v":1},{"$f":"U26+1","v":2},{"$f":"V26+1","v":3}]
["Schalter",0,"nicht zugewiesen"]
[null,{"$f":"B27+1","v":1},"Geber P1","Geber Quer"]
[null,{"$f":"B28+1","v":2},"Geber P2","Geber Höhe"]
[null,3,"Geber P4","oben=L5","Geber Klappen","<4%=L2",">4%=L1","Geber Drossel"]
[null,4,"Geber P3","Geber Seite"]
[null,5,"Geber P5"]
[null,6,"Geber P6","Mixer4"]
[null,7,"Geber P7"]
[null,8,"Geber P8"]
[null,9,"SA"]
[null,10,"SB"]
[null,11,"SC"]
[null,12,"SD","unten=Ereignisansage:P_ZUEN~2.WAV","oben=Ereignisansage:P_ZUEN~1.WAV","oben=L1","unten=Motor Aus Schalter:","oben=Logging Schalter:"]
[null,13,"SE","Mitte=L6","oben=","oben=L3","unten=Sprach-Trigger-Schalter:"]
[null,14,"SF"]
[null,15,"SG"]
[null,16,"SH"]
[null,17,"SI"]
[null,18,"SJ"]
[null,19,"SK"]
[null,20,"SL"]
[]
[]
["Schalterstellung",-4000,"unten"]
[null,0,"Mitte"]
[null,4000,"oben"]
[]
["Laufrichtung",0,"normal"]
[null,1,"reverse"]
[]
["Vergleich",0,"<="]
[null,1,">="]
[]
["Bedingung",0,"<"]
[null,1,">"]
[null,2,"LIN"]
[{"$nulls":5},{"$f":"VLOOKUP(\"L1\",L_Index,2,0)","v":1}]
["Logtyp",0,"n.n."]
[null,1,"UND"]
[null,2,"ODER"]
[{"$nulls":3},"Zeilenindex L_Schalter","l_schalter_eintraege"]
["L_Schalter",-1,"nicht zugewiesen",{"$f":"ROW(B68)-ROW(L_Schalter)","v":0}]
[null,0,"L1",1,"L4","Motorein: Geber P4>4% UND SD,oben"]
[null,1,"L2",2,"Motoraus: Geber P4<4% n.n. nicht zugewiesen"]
[null,2,"L3",3,"TeleAnsage: SE,oben ODER MX2,oben","Sprach-Wiederh.-Schalter:"]
[null,3,"L4",4,"Leerlauf: L1,oben UND MX3,oben","Ereignisansage:T_DING.WAV"]
[null,4,"L5",5,"Ereignisansage:T_ERROR.WAV","Klappenaus: MX4,oben UND Geber P4,oben"]
[null,5,"L6",6,"Telemaus: Q2,oben UND SE,Mitte","Ereignisansage:AUTOTE~1.WAV"]
[null,6,"L7",7]
[null,7,"L8",8]
[null,8,"L9",9]
[null,9,"L10",10]
[null,10,"L11",11]
[null,11,"L12",12]
[null,12,"L13",13]
[null,13,"L14",14]
[null,14,"L15",15]
[null,15,"L16",16]
["Tel.Geber",48,"MX1",17,"Höheschal: > 1 +/- 0"]
[null,{"$f":"B85+1","v":49},"MX2",18,"Kapa: > 2200 +/- 0","L3"]
[null,50,"MX3",19,"L4","Standgas: < 3 +/- 0"]
[null,51,"MX4",20,"Segelhöhe: > 30 +/- 0","L5"]
[null,52,"MX5",21]
[null,53,"MX6",22]
[null,54,"MX7",23]
[null,55,"MX8",24]
["Lagesensoren",64,"GX1",25]
[null,65,"GX2",26]
[null,66,"GX3",27]
[null,{"$f":"B95+1","v":67},"GX4",28]
[null,{"$f":"B96+1","v":68},"GX5",29]
[null,{"$f":"B97+1","v":69},"GX6",30]
[null,70,"GX7",31]
["Sequenzer",80,"Q1",{"$f":"ROW(B100)-ROW(L_Schalter)","v":32},"Alarm: nicht zugewiesen"]
[null,81,"Q2",33,"L6","Telemaus: SE,oben"]
[null,82,"Q3",34]
[null,83,"Q4",35]
[null,84,"Q5",36]
[null,85,"Q6",37]
[null,86,"Q7",38]
[null,87,"Q8",39]
["Kan. Su.Sig.",90,"CH1",40]
[null,91,"CH2",41]
[null,92,"CH3",42]
[null,93,"CH4",43]
[null,94,"CH5",44]
[null,95,"CH6",45]
[null,96,"CH7",46]
[null,97,"CH8",47]
["Trimmtaster",106,"Tr1",48]
[null,107,"Tr2",49]
[null,108,"Tr3",50]
[null,109,"Tr4",51]
[null,110,"Tr5",52]
[null,111,"Tr6",53]
[null,112,"Tr7",54]
[null,113,"Tr8",55]
[]
[]
["Bedingung_MX",0,"<"]
[null,1,">"]
[null,2,"="]
[]
["ja_nein",0,"nein"]
[null,1,"ja"]
[]
["ein_aus",0,"aus"]
[null,1,"ein"]
[{"$nulls":4},"dient nur Analysezwecken"]
[{"$nulls":5},"Byte","liHB","reHB"]
["Servo",257,"Quer1",null,{"$f":"B137-256","v":1},{"$f":"RIGHT(\"0000000\"&DEC2BIN(E137),8)","v":"00000001"},{"$f":"LEFT(F137,4)","v":"0000"},{"$f":"RIGHT(F137,4)","v":"0001"}]
[null,258,"Quer2",null,{"$f":"B138-256","v":2},"00000010",{"$f":"LEFT(F138,4)","v":"0000"},{"$f":"RIGHT(F138,4)","v":"0010"}]
[null,259,"Quer3",null,3,"00000011","0000","0011"]
[null,260,"Quer4",null,4,"00000100","0000","0100"]
[null,261,"Klappen1",null,5,"00000101","0000","0101"]
[null,262,"Klappen2",null,6,"00000110","0000","0110"]
[null,263,"Klappen3",null,7,"00000111","0000","0111"]
[null,264,"Klappen4",null,8,"00001000","0000","1000"]
[null,265,"Seite1",null,9,"00001001","0000","1001"]
[null,266,"Seite2",null,10,"00001010","0000","1010"]
[null,267,"Höhe1",null,11,"00001011","0000","1011"]
[null,268,"Höhe2",null,12,"00001100","0000","1100"]
[null,269,"??",null,13,"00001101","0000","1101"]
[null,270,"??",null,14,"00001110","0000","1110"]
[null,271,"Drossel",null,15,"00001111","0000","1111"]
[null,275,"Fahrwerk1",null,19,"00010011","0001","0011"]
[null,276,"Fahrwerk2",null,20,"00010100","0001","0100"]
[null,277,"Fahrwerk3",null,21,"00010101","0001","0101"]
[null,278,"Fahrwerk4",null,22,"00010110","0001","0110"]
[null,279,"StörKl1",null,23,"00010111","0001","0111"]
[null,280,"StörKl2",null,24,"00011000","0001","1000"]
[null,281,"TS (1F)",null,{"$f":"B158-256","v":25},"00011001","0001",{"$f":"RIGHT(F158,4)","v":"1001"}]
[null,282,"TS (2L)",null,26,"00011010","0001","1010"]
[null,283,"TS (3R)",null,27,"00011011","0001","1011"]
[null,284,"??",null,28,"00011100","0001","1100"]
[null,285,"Heck",null,29,"00011101","0001","1101"]
[null,286,"??",null,30,"00011110","0001","1110"]
[null,287,"Gyroempf",null,31,"00011111","0001","1111"]
[null,288,{"$f":"IF(ISERROR(VLOOKUP(D165,sv_function,2,FALSE))=TRUE,\"nicht zugewiesen\",VLOOKUP(D165,sv_function,2,FALSE))","v":"nicht zugewiesen"},14,{"$f":"B165-256","v":32},{"$f":"RIGHT(\"0000000\"&DEC2BIN(E165),8)","v":"00100000"},"0010","0000"]
[null,289,"nicht zugewiesen",15,{"$f":"B166-256","v":33},{"$f":"RIGHT(\"0000000\"&DEC2BIN(E166),8)","v":"00100001"},"0010","0001"]
[null,290,"nicht zugewiesen",16,34,"00100010","0010","0010"]
[null,291,"nicht zugewiesen",17,35,"00100011","0010","0011"]
[null,292,"nicht zugewiesen",18,36,"00100100","0010","0100"]
[null,293,"nicht zugewiesen",19,37,"00100101","0010","0101"]
[null,294,"nicht zugewiesen",20,38,"00100110","0010","0110"]
[null,295,"nicht zugewiesen",21,39,"00100111","0010","0111"]
[null,296,"nicht zugewiesen",22,40,"00101000","0010","1000"]
[null,297,"nicht zugewiesen",23,41,"00101001","0010","1001"]
[null,298,"nicht zugewiesen",24,42,"00101010","0010","1010"]
[null,299,"nicht zugewiesen",25,43,"00101011","0010","1011"]
[null,300,"nicht zugewiesen",26,44,"00101100","0010","1100"]
[]
["User_Menu",1,"Modell auswählen"]
[null,2,"Neues Modell anlegen"]
[null,3,"Grundeinstellungen"]
[null,4,"Taumelscheibenmischer "]
[null,5,"Funktion+Geberzuordnung"]
[null,6,"Servozuordnung"]
[null,7,"Servoeinstellungen"]
[null,8,"Flugphasen"]
[null,9,"Digitaltrimmung"]
[null,10,"Flugphasentrimmung"]
[null,11,"Dual Rate/Expo"]
[null,12,"Funktionskurven"]
[null,13,"Kreiseleinstellungen"]
[null,14,"Querruderdifferenzierung"]
[null,15,"V-Leitwerksmischer"]
[null,16,"Ailevator"]
[null,17,"Delta/Elevon Mischer"]
[null,18,"Butterfly"]
[null,19,"Freie Mischer"]
[null,20,"Spezielle Modelloptionen"]
[null,21,"Stick/Schalter Setup"]
[null,22,"Logische Schalter"]
[null,23,"Sprachausgabe/Ereignis"]
[null,24,"Stoppuhren"]
[null,25,"Alarme"]
[null,26,"Sensoren/Aufzeichnung"]
[null,27,"Telemetrieanzeige"]
[null,28,"Senderkoniguration"]
[null,29,"Gebermonitor (1/2)"]
[null,30,"Gebermonitor (2/2)"]
[null,31,"Servomonitor"]
[null,32,"Systemsounds"]
[null,33,"Reichweiten-/Servotest"]
[null,34,"Drahtlosmodus/Trainer"]
[null,35,"Trim"]
[null,36,"Benutzermenü-Setup"]
[null,37,"Audio Player"]
[null,38,"Jetibox"]
[null,39,"USB/Data"]
[null,40,"Systeminformationen"]
[null,41,"Vario"]
[null,42,"Lautstärke"]
[null,43,"Gaslimiter"]
[null,44,"Sprachausgabe"]
[null,45,"Snap Roll"]
[null,46,"Sequenzer"]
[null,47,"Spiele"]
[null,48,"Rc Schalter"]
[null,49,"Datenanalyse"]
[null,50,"Geräteübersicht"]
[null,51,"Governoreinstellungen"]
[null,52,"Heli Assistent"]
[null,53,"Installierte Module"]
[null,54,"Ton des Proportionalgebers"]
[null,55,"Telemetriegeber"]

{"sheet":"Versionshistorie","index":2,"n_rows":36,"n_cols":2,"rows_kept":36}
["Version","Änderungen"]
["1 bis 4","Entwicklungsversionen"]
[5,"erste freigegebene Version"]
["5.1","Tabellenblatt Versionshistorie angelegt"]
[null,"Neue Parameter: Softwarestand Sender, Alarme loggen"]
[null,"Farbliche Kennzeichnung der zur Aufbereitung in Spalte \"E\" verwendeten Teile der Multi-Parameter"]
[null,"Berücksichtigung älterer Versionan als 3.02 bei der Aufbereitung der Funktionsspezifikation"]
[null,"Einfügen von Kommentaren als Hilfe-Infos in die Überschriftszeilen der Multi-Parameter"]
["5.2","Zuordnung Servos zu Funktionen eingefügt"]
["5.3","Parameter Versionsnumer Senderfirmware eingefügt"]
[null,"Unterstützung Firmwareversionen < 3.02 im Bereich der Funktionsspezifikationen (Parameter Sym fehlt)"]
[null,"Fehler bei Schalterzuordnung behoben (Schalter SL)"]
[null,"Fehler bei Schalterzuordnung der Alarme behoben (logische Schalter wurden nicht angezeigt)"]
[null,"Bei Alarmen Name der .wav-Datei ohne Dateieindung in Spalte E übernommen"]
["5.4","Fehler bei Schalterbestimmung Flugphasen behoben. Jetzt werden auch logische Schalter angezeigt."]
[null,"Schalterwerte bei logischen Schaltern eliminiert, da ja nur ein und aus möglich"]
[null,"VoiceTrigger Schalter aufgenommen"]
[null,"Voice Wiederholungs Schalter aufgenommen"]
["5.5","Schalter-Tabelle im Blatt \"Umsetzungstabellen\" für weitere Aufbereitungen mit allen Schalterwerten versehen. Obergrenze = 20 Einträge pro Schalter."]
[null,"L-Schalter-Tabelle im Blatt \"Umsetzungstabellen\" für weitere Aufbereitungen  mit allen Schalterwerten versehen. Obergrenze = 100 Einträge insgesamt."]
[null,"Telemetriegeber um Proportionalgeber ergänzt, bisher nur Typ Switch unterstützt."]
[null,"Schalterwerte bei logischen Schalten wieder eingefügt (werden doch benötigt)."]
[null,"Labels alle auch in Spalte E übernommen. Dadurch Kurzübersicht möglich, indem alle Spalten außer A und E ausgeblendet werden."]
[null,"Spalte D für weitere Aufbereitungen bei Multi Parametern mit Excerpt aus Spalte E versehen."]
[null,"User Menü  in Modellwerte übernommen"]
[null,"Formeln für L-Schalter, Telemetriegeber und Sequenzer durch Funktionen ersetzt."]
["5.6","Servoeinstellungen mit Servocode -1 ebenfalls ausblenden"]
[null,"Tabellenblatt Übersicht eingefügt."]
[null,"Funktion\" Modellwerte speichern\" eingefügt."]
[null,"Phasen-Trim in Bereich Funktionsspezifikation mit aufgenommen."]
[null,"Überlauf-Fehler in Funktion n_sw behoben."]
[null,"Überlauf-Fehler in Funktion nur_sw behoben."]
[null,"Jeti Ungereimtheit bei Verknüpfung Flugphasen ausgebügelt."]
[null,"Benutzername in erste Zeile eingefügt."]
["5.7","Anpassung an Senderversion 4.22: Neuer Param SmthCrv vor Switch bei freiem Mixer"]
["5.8","Auswertung gesamtes Verzeichnis inkl. Erstellung Modelldatei und pdf-Ausdruck der ersten beiden Spalten."]

{"sheet":"Übersicht","index":3,"n_rows":37,"n_cols":7,"rows_kept":37}
["Modellname:","Modellzeit:","gebundener Empfänger:","Motor Aus Schalter:","Sprach-Trigger-Schalter:","Sprach-Wiederh.-Schalter:"]
["Fokker",0.12270833333333334,"42641:24522","SD,unten","nicht zugewiesen","nicht zugewiesen",{"$f":"A2","v":"Fokker"}]
["Me 109",0.2075810185185185,"42344:24338","SD,unten","nicht zugewiesen","nicht zugewiesen","Me 109"]
["Niklaus gelb",0.23319444444444445,"42323:19281","SD,unten","nicht zugewiesen","nicht zugewiesen","Niklaus gelb"]
["Charter futaba",0.2509953703703704,"43793:23910","SD,unten","SE,unten","SE,oben","Charter futaba"]
["FW 190",0.19240740740740742,"42533:19517","SD,unten","nicht zugewiesen","nicht zugewiesen","FW 190"]
["Klemm25",0.33318287037037037,"42333:19250","SD,unten","nicht zugewiesen","nicht zugewiesen","Klemm25"]
["Bronco",0.3306828703703703,"42533:26511","SD,unten","nicht zugewiesen","nicht zugewiesen","Bronco"]
["Wonder",0.549837962962963,"42325:17367","SD,unten","nicht zugewiesen","nicht zugewiesen","Wonder"]
["Siemens-S-E1",0.3887152777777778,"43793:31888","SD,unten","SE,unten","L2,oben","Siemens-S-E1"]
["Nikolaus rot",0.43885416666666666,"42533:20742","SD,unten","SE,unten","L2,oben","Nikolaus rot"]
["Tora",0.6261226851851852,"42533:28268","SD,unten","SE,unten","L2,oben","Tora"]
["Telemaster",0.5238888888888888,"42323:16814","SD,unten","SE,Mitte","nicht zugewiesen","Telemaster"]
["Mosquito",1.1559953703703703,"42533:28823","SD,unten","SE,unten","SE,oben","Mosquito"]
["Papagei",1.2537962962962965,"42323:16814","SD,unten","SE,unten","L3,Mitte","Papagei"]
["M35",0.9558333333333333,"42565:18394","SD,unten","L2,unten","SE,oben","M35"]
["Kraehe",0.054953703703703706,"42613:21176","nicht zugewiesen","SE,unten","SE,oben","Kraehe"]
["W Me 109",0.08752314814814814,"43797:20735","SD,unten","SE,unten","L9,oben","W Me 109"]
["BiC-Fly",0.13315972222222222,"43825:22230","SD,unten","L2,unten","L3,Mitte","BiC-Fly"]
["ASK18",0.12025462962962963,"42641:24522","nicht zugewiesen","SE,unten","SE,oben","ASK18"]
["HE 2",0.8470833333333334,"42565:18394","SD,unten","L2,unten","SE,oben","HE 2"]
["Floride",0.6191898148148148,"42641:31485","SD,unten","SE,unten","SE,oben","Floride"]
["Aton",1.0469212962962962,"42533:19860","SD,unten","L5,Mitte","L6,oben","Aton"]
["TestFrank",9.131944444444446E-3,"42641:32384","nicht zugewiesen","nicht zugewiesen","nicht zugewiesen","TestFrank"]
["Thermy3",0.00894675925925926,"42641:32384","SD,unten","SE,unten","L3,oben","Thermy3"]
["Flamingo",0.046273148148148154,"42323:19281","SD,unten","nicht zugewiesen","nicht zugewiesen","Flamingo"]
["Klemm Bello",0.03280092592592592,"43825:22230","SD,unten","nicht zugewiesen","nicht zugewiesen","Klemm Bello"]
["Donjo",0.27274305555555556,"42641:31111","SD,unten","SE,unten","SE,oben","Donjo"]
["Mo1QSTneu",9.6064814814814819E-4,"0:0","SD,unten","nicht zugewiesen","nicht zugewiesen","Mo1QSTneu"]
["Mo2QSTalt",0,"42533:26511","SD,unten","nicht zugewiesen","nicht zugewiesen","Mo2QSTalt"]
["Se4KlTneu",0,"42325:17367","SD,unten","nicht zugewiesen","nicht zugewiesen","Se4KlTneu"]
["UCanFly",0.1691550925925926,"42325:17367","SD,unten","nicht zugewiesen","nicht zugewiesen","UCanFly"]
["SpaceW Ulli",0.020833333333333332,"43825:18149","SD,unten","SE,unten","SE,oben","SpaceW Ulli"]
["Sensortest",0.08589120370370369,"42613:21176","nicht zugewiesen","L1,unten","SE,oben","Sensortest"]
["Bronco2",0.013483796296296296,"42533:26511","SD,unten","nicht zugewiesen","nicht zugewiesen","Bronco2"]
["Sukhoi",0.06237268518518518,"42323:16814","SD,unten","SE,Mitte","nicht zugewiesen","Sukhoi"]
[0,0,"0:0",{"$error":"#VALUE!"},{"$error":"#VALUE!"},{"$error":"#VALUE!"}]